Welcome to AC Web.
Results 1 to 5 of 5
  1. #1


    Join Date
    May 2018
    Location
    United Kingdom
    Posts
    6

    Problem with compiling TrinityCore


    REGISTER! (FREE)
    Registered members see less ads
    and also gain access to other great features.
    When trying to compile TrinityCore 3.3.5a I get the following errors:



    http://i.imgur.com/snqo2uP.png

    Does anyone know how to fix this? Thank you.

  2. #2


    Join Date
    Aug 2015
    Location
    rustemu.org
    Posts
    195
    in cmake, when program suggest you to choose a platform and compiler - you should to select your visual studio version and WIN64

  3. #3


    Join Date
    Mar 2016
    Location
    I'm done with wow emulation
    Posts
    1,077
    You said you're trying to compile TrinityCore 3.3.5, Jamie, but I'm 100% sure you cloned the master branch which is legion 7.3.5.
    There's no bnetserver on tc 3.3.5.
    Last edited by mindsear; 05-24-2018 at 03:04 PM.

  4. #4
    1. In CMake you need to choose the native compiler "Visual Studio Win64"

    2. You are on the Legion Branch you need to switch the branch to "3.3.5" in order to have the 3.3.5a stuff

  5. #5

    REGISTER! (FREE)
    Registered members see less ads
    and also gain access to other great features.
    Please helpme with this error when compiling
    24>Creature.cpp
    24>D:\Ashamane\AshamaneCore\src\server\game\Entiti es\Object\Object.h(218): warning C4018: '>=': signed/unsigned mismatch (compiling source file D:\Ashamane\AshamaneCore\src\server\game\Entities\ Conversation\Conversation.cpp)
    24>D:\Ashamane\AshamaneCore\src\server\game\Entiti es\Conversation\Conversation.cpp(163): note: see reference to function template instantiation 'const T *Object::GetDynamicStructuredValue<ConversationDyn amicFieldActor>(uint16,uint16) const' being compiled
    24> with
    24> [
    24> T=ConversationDynamicFieldActor
    24> ]
    24>C:\local\boost_1_63_0\boost/bind/placeholders.hpp(54): note: see reference to class template instantiation 'boost::arg<9>' being compiled (compiling source file D:\Ashamane\AshamaneCore\src\server\game\Entities\ Conversation\Conversation.cpp)
    24>C:\local\boost_1_63_0\boost/bind/placeholders.hpp(53): note: see reference to class template instantiation 'boost::arg<8>' being compiled (compiling source file D:\Ashamane\AshamaneCore\src\server\game\Entities\ Conversation\Conversation.cpp)
    24>C:\local\boost_1_63_0\boost/bind/placeholders.hpp(52): note: see reference to class template instantiation 'boost::arg<7>' being compiled (compiling source file D:\Ashamane\AshamaneCore\src\server\game\Entities\ Conversation\Conversation.cpp)
    24>C:\local\boost_1_63_0\boost/bind/placeholders.hpp(51): note: see reference to class template instantiation 'boost::arg<6>' being compiled (compiling source file D:\Ashamane\AshamaneCore\src\server\game\Entities\ Conversation\Conversation.cpp)
    24>C:\local\boost_1_63_0\boost/bind/placeholders.hpp(50): note: see reference to class template instantiation 'boost::arg<5>' being compiled (compiling source file D:\Ashamane\AshamaneCore\src\server\game\Entities\ Conversation\Conversation.cpp)
    24>C:\local\boost_1_63_0\boost/bind/placeholders.hpp(49): note: see reference to class template instantiation 'boost::arg<4>' being compiled (compiling source file D:\Ashamane\AshamaneCore\src\server\game\Entities\ Conversation\Conversation.cpp)
    24>C:\local\boost_1_63_0\boost/bind/placeholders.hpp(48): note: see reference to class template instantiation 'boost::arg<3>' being compiled (compiling source file D:\Ashamane\AshamaneCore\src\server\game\Entities\ Conversation\Conversation.cpp)
    24>C:\local\boost_1_63_0\boost/bind/placeholders.hpp(47): note: see reference to class template instantiation 'boost::arg<2>' being compiled (compiling source file D:\Ashamane\AshamaneCore\src\server\game\Entities\ Conversation\Conversation.cpp)
    24>C:\local\boost_1_63_0\boost/bind/placeholders.hpp(46): note: see reference to class template instantiation 'boost::arg<1>' being compiled (compiling source file D:\Ashamane\AshamaneCore\src\server\game\Entities\ Conversation\Conversation.cpp)
    25>cs_list.cpp

    25>cs_misc.cpp
    24>D:\Ashamane\AshamaneCore\src\server\game\Entiti es\Object\Object.h(218): warning C4018: '>=': signed/unsigned mismatch (compiling source file D:\Ashamane\AshamaneCore\src\server\game\Entities\ Item\Item.cpp)
    24>D:\Ashamane\AshamaneCore\src\server\game\Entiti es\Item\Item.cpp(1293): note: see reference to function template instantiation 'const T *Object::GetDynamicStructuredValue<ItemDynamicFiel dGems>(uint16,uint16) const' being compiled
    24> with
    24> [
    24> T=ItemDynamicFieldGems
    24> ]
    24>C:\local\boost_1_63_0\boost/bind/placeholders.hpp(54): note: see reference to class template instantiation 'boost::arg<9>' being compiled (compiling source file D:\Ashamane\AshamaneCore\src\server\game\Entities\ Item\Item.cpp)
    24>C:\local\boost_1_63_0\boost/bind/placeholders.hpp(53): note: see reference to class template instantiation 'boost::arg<8>' being compiled (compiling source file D:\Ashamane\AshamaneCore\src\server\game\Entities\ Item\Item.cpp)
    24>C:\local\boost_1_63_0\boost/bind/placeholders.hpp(52): note: see reference to class template instantiation 'boost::arg<7>' being compiled (compiling source file D:\Ashamane\AshamaneCore\src\server\game\Entities\ Item\Item.cpp)
    24>C:\local\boost_1_63_0\boost/bind/placeholders.hpp(51): note: see reference to class template instantiation 'boost::arg<6>' being compiled (compiling source file D:\Ashamane\AshamaneCore\src\server\game\Entities\ Item\Item.cpp)
    24>C:\local\boost_1_63_0\boost/bind/placeholders.hpp(50): note: see reference to class template instantiation 'boost::arg<5>' being compiled (compiling source file D:\Ashamane\AshamaneCore\src\server\game\Entities\ Item\Item.cpp)
    24>C:\local\boost_1_63_0\boost/bind/placeholders.hpp(49): note: see reference to class template instantiation 'boost::arg<4>' being compiled (compiling source file D:\Ashamane\AshamaneCore\src\server\game\Entities\ Item\Item.cpp)
    24>C:\local\boost_1_63_0\boost/bind/placeholders.hpp(48): note: see reference to class template instantiation 'boost::arg<3>' being compiled (compiling source file D:\Ashamane\AshamaneCore\src\server\game\Entities\ Item\Item.cpp)
    24>C:\local\boost_1_63_0\boost/bind/placeholders.hpp(47): note: see reference to class template instantiation 'boost::arg<2>' being compiled (compiling source file D:\Ashamane\AshamaneCore\src\server\game\Entities\ Item\Item.cpp)
    24>C:\local\boost_1_63_0\boost/bind/placeholders.hpp(46): note: see reference to class template instantiation 'boost::arg<1>' being compiled (compiling source file D:\Ashamane\AshamaneCore\src\server\game\Entities\ Item\Item.cpp)
    24>Object.cpp

    24>D:\Ashamane\AshamaneCore\src\server\game\Garris on\WodGarrison\WodGarrison.cpp(198): fatal error C1001: An internal error has occurred in the compiler.
    24>(compiler file 'f:\dd\vctools\compiler\cxxfe\sl\p1\c\funcs.c', line 7945)
    24> To work around this problem, try simplifying or changing the program near the locations listed above.
    24>Please choose the Technical Support command on the Visual C++
    24> Help menu, or open the Technical Support help file for more information

    25>scripts.vcxproj -> D:\BAshamane\src\server\scripts\RelWithDebInfo\scr ipts.lib
    27>------ Build started: Project: worldserver, Configuration: RelWithDebInfo Win32 ------
    27>Generating CXX prefix header D:\BAshamane\src\server\worldserver\RelWithDebInfo \cotire\worldserver_CXX_prefix.hxx
    27>Building Custom Rule D:/Ashamane/AshamaneCore/src/server/worldserver/CMakeLists.txt
    27>CMake does not need to re-run because D:/BAshamane/src/server/worldserver/CMakeFiles/generate.stamp is up-to-date.
    27>Main.cpp
    27>Unknown compiler version - please run the configure tests and report the results
    27>CliRunnable.cpp
    27>RASession.cpp
    27>RESTService.cpp
    27>TCSoap.cpp
    27>WheatyExceptionReport.cpp
    27>ServiceWin32.cpp
    27>LINK : fatal error LNK1181: cannot open input file '..\game\RelWithDebInfo\game.lib'
    27>C:\Program Files (x86)\Microsoft Visual Studio\2017\Professional\Common7\IDE\VC\VCTargets\ Microsoft.CppCommon.targets(651,5): error MSB6006: "link.exe" exited with code 1181.
    27>Done building project "worldserver.vcxproj" -- FAILED.
    28>------ Build started: Project: ALL_BUILD, Configuration: RelWithDebInfo Win32 ------
    28>Building Custom Rule D:/Ashamane/AshamaneCore/CMakeLists.txt
    28>CMake does not need to re-run because D:/BAshamane/CMakeFiles/generate.stamp is up-to-date.
    29>------ Skipped Build: Project: INSTALL, Configuration: RelWithDebInfo Win32 ------
    29>Project not selected to build for this solution configuration
    ========== Build: 25 succeeded, 2 failed, 0 up-to-date, 2 skipped ==========

 

 

Posting Permissions

  • You may not post new threads
  • You may not post replies
  • You may not post attachments
  • You may not edit your posts
  •